docker base tests for scylladb stopped working

Israel Fruchter <fr...@...>

Recently the docker base tests for scylladb stopped working
the last confirmed one that was working (in our CI) was c97e84ef401d5a17c4c0b37c1af5fdad06db06fd

how can I figure out what is the issue there ?

$ java -version
java version "1.8.0_201"
Java(TM) SE Runtime Environment (build 1.8.0_201-b09)
Java HotSpot(TM) 64-Bit Server VM (build 25.201-b09, mixed mode)

$ mvn clean install -pl janusgraph-cql -Pscylladb

[ERROR] Tests run: 1, Failures: 0, Errors: 1, Skipped: 0, Time elapsed: 0.085 s <<< FAILURE! - in org.janusgraph.diskstorage.cql.CQLDistributedStoreManagerTest                                              
[ERROR] org.janusgraph.diskstorage.cql.CQLDistributedStoreManagerTest  Time elapsed: 0.085 s  <<< ERROR!                                                                                                     
        at org.janusgraph.diskstorage.cql.CQLDistributedStoreManagerTest.<clinit>(

Join to automatically receive all group messages.